x11/kdebase-3.5.6 compiled
Petr Janda
elekktretterr at exemail.com.au
Tue Feb 20 16:49:09 PST 2007
ProcessList.c: In function `updateProcess':
ProcessList.c:216: error: structure has no member named `kp_proc'
ProcessList.c:217: error: structure has no member named `kp_eproc'
ProcessList.c:218: error: structure has no member named `kp_eproc'
ProcessList.c:219: error: structure has no member named `kp_eproc'
ProcessList.c:221: error: structure has no member named `kp_thread'
ProcessList.c:225: error: structure has no member named `kp_proc'
ProcessList.c:232: error: structure has no member named `kp_proc'
ProcessList.c:261: error: structure has no member named `kp_proc'
ProcessList.c:262: error: structure has no member named `kp_eproc'
ProcessList.c:263: error: structure has no member named `kp_eproc'
ProcessList.c:265: error: structure has no member named `kp_thread'
ProcessList.c:265: error: structure has no member named `kp_thread'
ProcessList.c:270: error: structure has no member named `kp_proc'
ProcessList.c:270: error: structure has no member named `kp_proc'
ProcessList.c:270: error: structure has no member named `kp_proc'
ProcessList.c: In function `updateProcessList':
ProcessList.c:371: error: structure has no member named `kp_proc'
[wrapper.sh] note: The real command line, after the pkgsrc wrapper, was:
/usr/obj/pkgsrc/x11/kdebase3/work/.gcc/bin/gcc -DHAVE_CONFIG_H -I.
-I../../.. -I./../../CContLib -I./.. -DQT_THREAD_SUPPORT
-I/usr/obj/pkgsrc/x11/kdebase3/work/.buildlink/include -DLDAP_DEPRECATED
-I/usr/pkg/qt3/include -DGLX_GLXEXT_LEGACY
-I/usr/obj/pkgsrc/x11/kdebase3/work/.buildlink/include/krb5
-I/usr/obj/pkgsrc/x11/kdebase3/work/.buildlink/include/freetype2
-DNDEBUG -O2 -O -pipe -D_GNU_SOURCE -MT ProcessList.o -MD -MP -MF
. deps/ProcessList.Tpo -c -o ProcessList.o ProcessList.c
-L/usr/obj/pkgsrc/x11/kdebase3/work/.buildlink/lib
gmake[4]: *** [ProcessList.o] Error 1
gmake[4]: Leaving directory
`/usr/obj/pkgsrc/x11/kdebase3/work/kdebase-3.5.6/ksysguard/ksysguardd/FreeBSD'
gmake[3]: *** [all-recursive] Error 1
gmake[3]: Leaving directory
`/usr/obj/pkgsrc/x11/kdebase3/work/kdebase-3.5.6/ksysguard/ksysguardd'
gmake[2]: *** [all-recursive] Error 1
gmake[2]: Leaving directory
`/usr/obj/pkgsrc/x11/kdebase3/work/kdebase-3.5.6/ksysguard'
gmake[1]: *** [all-recursive] Error 1
gmake[1]: Leaving directory
`/usr/obj/pkgsrc/x11/kdebase3/work/kdebase-3.5.6'
gmake: *** [all] Error 2
*** Error code 2
Already posted this to the pkgsrc mailing list days ago but havnt got a
reply.
Im having all sorts of problems with C++ written programs. often times
compilation of packages like kde fail with "write error", and have to be
restarted and then its all ok.
Thanks,
Petr
More information about the Users
mailing list